DXeCCD

Vibrational and/or electronic energy levels

Data compiled by: Marilyn E. Jacox

State:   X

Vib.
sym.
 No.   Approximate
 type of mode
 cm-1   Med.   Method   References

CD stretch 2545 Xe IR Khriachtchev, Tanskanen, et al., 2003
XeD stretch 1077.5 Xe IR Khriachtchev, Tanskanen, et al., 2003
Feldman, Sukhov, et al., 2003
CCD bend 491.5 Xe IR Khriachtchev, Tanskanen, et al., 2003

References

Khriachtchev, Tanskanen, et al., 2003
Khriachtchev, L.; Tanskanen, H.; Lundell, J.; Pettersson, M.; Kiljunen, H.; Rasanen, M., Fluorine-Free Organoxenon Chemistry: HXeCCH, HXeCC, and HXeCCXeH, J. Am. Chem. Soc., 2003, 125, 16, 4696, https://doi.org/10.1021/ja034485d . [all data]

Feldman, Sukhov, et al., 2003
Feldman, V.I.; Sukhov, F.F.; Orlov, A.Yu.; Tyulpina, I.V., Experimental Evidence for the Formation of HXeCCH: The First Hydrocarbon with an Inserted Rare-Gas Atom, J. Am. Chem. Soc., 2003, 125, 16, 4698, https://doi.org/10.1021/ja034585j . [all data]