(D2)LaD2+

Vibrational and/or electronic energy levels

Data compiled by: Marilyn E. Jacox

State:   X

Vib.
sym.
 No.   Approximate
 type of mode
 cm-1   Med.   Method   References

LaD2 s-stretch 1044.1 Ar IR Wang, Chertihin, et al., 2002
LaD2 a-stretch 1020.6 Ar IR Wang, Chertihin, et al., 2002

References

Wang, Chertihin, et al., 2002
Wang, X.; Chertihin, G.V.; Andrews, L., Matrix Infrared Spectra and DFT Calculations of the Reactive MH, J. Phys. Chem. A, 2002, 106, 40, 9213, https://doi.org/10.1021/jp026166z . [all data]