(D2)RhD2

Vibrational and/or electronic energy levels

Data compiled by: Marilyn E. Jacox

State:   X

Vib.
sym.
 No.   Approximate
 type of mode
 cm-1   Med.   Method   References

DD stretch 2234 w b T D2 IR Wang and Andrews, 2002
RhD stretch 1448.0 Ne IR Wang and Andrews, 2002
RhD stretch 1448.4 D2 IR Wang and Andrews, 2002
RhD stretch 1418.1 Ne IR Wang and Andrews, 2002
RhD stretch 1422 Ar IR Wang and Andrews, 2002
RhD stretch 1417.9 D2 IR Wang and Andrews, 2002

References

Wang and Andrews, 2002
Wang, X.; Andrews, L., Infrared Spectra of Rhodium Hydrides in Solid Argon, Neon, and Deuterium with Supporting Density Functional Calculations, J. Phys. Chem. A, 2002, 106, 15, 3706, https://doi.org/10.1021/jp013624f . [all data]