AlSiD3

Vibrational and/or electronic energy levels

Data compiled by: Marilyn E. Jacox

State:   X

Vib.
sym.
 No.   Approximate
 type of mode
 cm-1   Med.   Method   References

a1 2 Deformation 618.4 Ar IR Gaertner, Himmel, et al., 2004

References

Gaertner, Himmel, et al., 2004
Gaertner, B.; Himmel, H.-J.; Macrae, V.A.; Downs, A.J.; Greene, T.M., Matrix Reactivity of Al and Ga Atoms (M) in the Presence of Silane: Generation and Characterization of theη2-Coordinated Complex M•SiH4, the Insertion Product HMSiH3, and the MI Species MSiH3 in a Solid Argon Matrix, Chem. Eur. J., 2004, 10, 14, 3430, https://doi.org/10.1002/chem.200305493 . [all data]