D2O3

Vibrational and/or electronic energy levels

Data compiled by: Marilyn E. Jacox

State:   X

Vib.
sym.
 No.   Approximate
 type of mode
 cm-1   Med.   Method   References

a 1 OD s-stretch 2610.4 Ar IR Engdahl and Nelander, 2002
5 Sym. torsion 273.5 Ar IR Engdahl and Nelander, 2002
b 6 OD a-stretch 2610.4 Ar IR Engdahl and Nelander, 2002
7 DOO a-bend 1007.3 Ar IR Engdahl and Nelander, 2002
8 O3 a-stretch 762.6 Ar IR Engdahl and Nelander, 2002
9 Asym. torsion 301.6 Ar IR Engdahl and Nelander, 2002

References

Engdahl and Nelander, 2002
Engdahl, A.; Nelander, B., The Vibrational Spectrum of H2O3, Science, 2002, 295, 5554, 482, https://doi.org/10.1126/science.1067235 . [all data]