La(OD)2

Vibrational and/or electronic energy levels

Data compiled by: Marilyn E. Jacox

State:   X

Vib.
sym.
 No.   Approximate
 type of mode
 cm-1   Med.   Method   References

a1 2 LaO2 s-stretch 517.3 Ar IR Zhang, Shao, et al., 2001
b2 7 OD a-stretch 2753.5 Ar IR Wang and Andrews, 2006

References

Zhang, Shao, et al., 2001
Zhang, L.; Shao, L.; Zhou, M., Reactions of laser-ablated Y and La atoms with H2O Infrared spectra and density functional calculations of the HMO, HMOH and M(OH)2 molecules in solid argon, Chem. Phys., 2001, 272, 1, 27, https://doi.org/10.1016/S0301-0104(01)00450-5 . [all data]

Wang and Andrews, 2006
Wang, X.; Andrews, L., Infrared Spectra and Density Functional Calculations for M(OH), J. Phys. Chem. A, 2006, 110, 12, 4157, https://doi.org/10.1021/jp0570263 . [all data]