CD2MgF

Vibrational and/or electronic energy levels

Data compiled by: Marilyn E. Jacox

State:   X

Vib.
sym.
 No.   Approximate
 type of mode
 cm-1   Med.   Method   References

a1 MgF stretch 762.9 Ar IR Bare, Citra, et al., 2000

References

Bare, Citra, et al., 2000
Bare, W.D.; Citra, A.; Trindle, C.; Andrews, L., Matrix Infrared Spectroscopic Study of Magnesium Carbene and Carbenoid Radicals and Analysis of Their Bonding with Density Functional Calculations, Inorg. Chem., 2000, 39, 6, 1204, https://doi.org/10.1021/ic991229m . [all data]