DAlPD2

Vibrational and/or electronic energy levels

Data compiled by: Marilyn E. Jacox

State:   X

Vib.
sym.
 No.   Approximate
 type of mode
 cm-1   Med.   Method   References

3 AlD stretch 1288.4 Ar IR Himmel, Downs, et al., 2001
5 PD2 wag 532.3 Ar IR Himmel, Downs, et al., 2001

References

Himmel, Downs, et al., 2001
Himmel, H.-J.; Downs, A.J.; Greene, T.M., Reactions of Aluminum, Gallium, and Indium (M) Atoms with Phosphine: Generation and Characterization of the Species M·PH, Inorg. Chem., 2001, 40, 2, 396, https://doi.org/10.1021/ic000837v . [all data]