DGaND2

Vibrational and/or electronic energy levels

Data compiled by: Marilyn E. Jacox

State:   X

Vib.
sym.
 No.   Approximate
 type of mode
 cm-1   Med.   Method   References

a' 3 GaD stretch 1249.5 Ar IR Himmel, Downs, et al., 2000
4 ND2 scissors 1145.0 Ar IR Himmel, Downs, et al., 2000
5 GaN stretch 626.6 Ar IR Himmel, Downs, et al., 2000
6 ND2 rock 563.5 Ar IR Himmel, Downs, et al., 2000

References

Himmel, Downs, et al., 2000
Himmel, H.-J.; Downs, A.J.; Greene, T.M., Thermal and Photochemical Reactions of Aluminum, Gallium, and Indium Atoms (M) in the Presence of Ammonia: Generation and Characterization of the Species M·NH, J. Am. Chem. Soc., 2000, 122, 40, 9793, https://doi.org/10.1021/ja001313x . [all data]