D2CBrD+

Vibrational and/or electronic energy levels

Data compiled by: Marilyn E. Jacox

State:   X

Vib.
sym.
 No.   Approximate
 type of mode
 cm-1   Med.   Method   References

1 CD2 a-stretch 2440.3 w m Ne IR Lugez, Forney, et al., 1997
3 BrD stretch 1727.1 w m Ne IR Lugez, Forney, et al., 1997

References

Lugez, Forney, et al., 1997
Lugez, C.L.; Forney, D.; Jacox, M.E.; Irikura, K.K., The vibrational spectra of molecular ions isolated in solid neon. XIV. CH[sub 3]F[sup +], CH[sub 3]Cl[sup +], CH[sub 3]Br[sup +], and their ylidion isomers, J. Chem. Phys., 1997, 106, 2, 489, https://doi.org/10.1063/1.473390 . [all data]