DBND2

Vibrational and/or electronic energy levels

Data compiled by: Marilyn E. Jacox

State:   X

Vib.
sym.
 No.   Approximate
 type of mode
 cm-1   Med.   Method   References

ND stretch 2685.9 Ar IR Thompson, Andrews, et al., 1995
ND stretch 2678.7 Ar IR Thompson, Andrews, et al., 1995

References

Thompson, Andrews, et al., 1995
Thompson, C.A.; Andrews, L.; Martin, J.M.L.; El-Yazal, J., Infrared Spectra of Boron-Ammonia Reaction Products in Solid Argon, J. Phys. Chem., 1995, 99, 38, 13839, https://doi.org/10.1021/j100038a015 . [all data]