ZrD4

Vibrational and/or electronic energy levels

Data compiled by: Marilyn E. Jacox

State:   X

Vib.
sym.
 No.   Approximate
 type of mode
 cm-1   Med.   Method   References

ZrD stretch 1166.6 Ar IR Chertihin and Andrews, 1995
Chertihin and Andrews, 1995, 2

References

Chertihin and Andrews, 1995
Chertihin, G.V.; Andrews, L., Infrared Spectra of ZrH4 and HfH4 in Solid Argon, J. Am. Chem. Soc., 1995, 117, 23, 6402, https://doi.org/10.1021/ja00128a048 . [all data]

Chertihin and Andrews, 1995, 2
Chertihin, G.V.; Andrews, L., Reactions of laser-ablated Zr and Hf atoms with hydrogen. Matrix infrared spectra of the MH, MH2, MH3, and MH4 molecules, J. Phys. Chem., 1995, 99, 41, 15004, https://doi.org/10.1021/j100041a014 . [all data]