cyc-D2SiCC

Vibrational and/or electronic energy levels

Data compiled by: Marilyn E. Jacox

State:   X

Vib.
sym.
 No.   Approximate
 type of mode
 cm-1   Med.   Method   References

a1 1 SiD2 stretch 1601.9 m Ar IR Maier, Pacl, et al., 1995
2 CC stretch 1771.1 w Ar IR Maier, Pacl, et al., 1995
3 SiC2 s-stretch 842.3 vs Ar IR Maier, Pacl, et al., 1995
4 SiD2 scissors 722.2 w m Ar IR Maier, Pacl, et al., 1995
b1 6 SiD2 stretch 1626.3 m Ar IR Maier, Pacl, et al., 1995
7 SiD deform. 500.5 w m Ar IR Maier, Pacl, et al., 1995
b2 8 SiD deform. 604.2 w m Ar IR Maier, Pacl, et al., 1995

References

Maier, Pacl, et al., 1995
Maier, G.; Pacl, H.; Reisenauer, H.P.; Meudt, A.; Janoschek, R., Silacyclopropyne: Matrix Spectroscopic Identification and ab Initio Investigations, J. Am. Chem. Soc., 1995, 117, 51, 12712, https://doi.org/10.1021/ja00156a008 . [all data]