cyc-DC=CDSi

Vibrational and/or electronic energy levels

Data compiled by: Marilyn E. Jacox

State:   X

Vib.
sym.
 No.   Approximate
 type of mode
 cm-1   Med.   Method   References

a1 1 CD stretch 2313.6 w Ar IR Maier, Pacl, et al., 1995
4 SiC stretch 769.1 vs Ar IR Maier, Pacl, et al., 1995
b1 6 CD deform. 518.4 s Ar IR Maier, Pacl, et al., 1995
b2 7 CD stretch 2248.7 w Ar IR Maier, Pacl, et al., 1995
8 CD deform. 938.6 w m Ar IR Maier, Pacl, et al., 1995
9 SiC stretch 583.9 s Ar IR Maier, Pacl, et al., 1995

References

Maier, Pacl, et al., 1995
Maier, G.; Pacl, H.; Reisenauer, H.P.; Meudt, A.; Janoschek, R., Silacyclopropyne: Matrix Spectroscopic Identification and ab Initio Investigations, J. Am. Chem. Soc., 1995, 117, 51, 12712, https://doi.org/10.1021/ja00156a008 . [all data]