DONO2

Vibrational and/or electronic energy levels

Data compiled by: Marilyn E. Jacox

State:   X

Vib.
sym.
 No.   Approximate
 type of mode
 cm-1   Med.   Method   References

a' 1 OD stretch 2621.5 m gas IR McGraw, Bernitt, et al., 1965
1 OD stretch 2601.5 Ar IR Chen, Lo, et al., 1992
1 OD stretch 2599.1 Ar IR Chen, Lo, et al., 1992
1 OD stretch 2576.5 N2 IR Guillory and Bernstein, 1975
Chen, Lo, et al., 1992
2 NO2 a-stretch 1688.36 vs gas IR McGraw, Bernitt, et al., 1965
Tan, Looi, et al., 1994
2 NO2 a-stretch 1678.6 Ar IR Chen, Lo, et al., 1992
2 NO2 a-stretch 1674.9 Ar IR Chen, Lo, et al., 1992
2 NO2 a-stretch 1669.2 N2 IR Guillory and Bernstein, 1975
Chen, Lo, et al., 1992
3 NO2 s-stretch 1308.4 vs gas IR McGraw, Bernitt, et al., 1965
3 NO2 s-stretch 1310.4 Ar IR Chen, Lo, et al., 1992
3 NO2 s-stretch 1311.1 N2 IR Guillory and Bernstein, 1975
Chen, Lo, et al., 1992
4 DON bend 1013.6 m gas IR McGraw, Bernitt, et al., 1965
4 DON bend 1013.4 Ar IR Chen, Lo, et al., 1992
4 DON bend 1012.2 Ar IR Chen, Lo, et al., 1992
4 DON bend 1032.4 N2 IR Guillory and Bernstein, 1975
Chen, Lo, et al., 1992
5 ON stretch 888.0 s gas IR McGraw, Bernitt, et al., 1965
5 ON stretch 894.2 Ar IR Chen, Lo, et al., 1992
5 ON stretch 884.5 Ar IR Chen, Lo, et al., 1992
5 ON stretch 906.0 N2 IR Guillory and Bernstein, 1975
Chen, Lo, et al., 1992
6 NO2 scissors 642.14 s gas IR McGraw, Bernitt, et al., 1965
Maki, Tan, et al., 1993
6 NO2 scissors 660 N2 IR Guillory and Bernstein, 1975
7 NO2 rock 541.58 w gas IR McGraw, Bernitt, et al., 1965
Maki, Tan, et al., 1993
7 NO2 rock 559.9 N2 IR Guillory and Bernstein, 1975
Chen, Lo, et al., 1992
a 8 ONO2 OPLA 762.87 s gas IR McGraw, Bernitt, et al., 1965
Tan, Looi, et al., 1991
8 ONO2 OPLA 763.7 Ar IR Chen, Lo, et al., 1992
8 ONO2 OPLA 767.7 N2 IR Guillory and Bernstein, 1975
Chen, Lo, et al., 1992
9 Torsion 343.85 m gas IR McGraw, Bernitt, et al., 1965
van der Veken, Pieters, et al., 1982
Tan, Looi, et al., 1991, 2
9 Torsion 361 N2 IR Guillory and Bernstein, 1975

References

McGraw, Bernitt, et al., 1965
McGraw, G.E.; Bernitt, D.L.; Hisatsune, I.C., Vibrational Spectra of Isotopic Nitric Acids, J. Chem. Phys., 1965, 42, 1, 237, https://doi.org/10.1063/1.1695682 . [all data]

Chen, Lo, et al., 1992
Chen, W.-J.; Lo, W.-J.; Cheng, B.-M.; Lee, Y.-P., Photolysis of nitric acid in solid nitrogen, J. Chem. Phys., 1992, 97, 10, 7167, https://doi.org/10.1063/1.463541 . [all data]

Guillory and Bernstein, 1975
Guillory, W.A.; Bernstein, M.L., Infrared spectrum of matrix-isolated nitric acid, J. Chem. Phys., 1975, 62, 3, 1058, https://doi.org/10.1063/1.430519 . [all data]

Tan, Looi, et al., 1994
Tan, T.L.; Looi, E.C.; Lua, K.T.; Maki, A.G.; Johns, J.W.C.; Noel, M., FTIR Spectrum of the ν2 Band of Deuterated Nitric-Acid (DNO3), J. Mol. Spectrosc., 1994, 166, 1, 97, https://doi.org/10.1006/jmsp.1994.1175 . [all data]

Maki, Tan, et al., 1993
Maki, A.G.; Tan, T.L.; Looi, E.C.; Lua, K.T.; Johns, J.W.C.; Nol, M., Infrared Spectrum of the ν6 and ν7 Bands of Deuterated Nitric Acid (DNO3), J. Mol. Spectrosc., 1993, 157, 1, 248, https://doi.org/10.1006/jmsp.1993.1020 . [all data]

Tan, Looi, et al., 1991
Tan, T.L.; Looi, E.C.; Lua, K.T.; Maki, A.G.; Johns, J.W.C.; Noel, M., High resolution FTIR measurement and analysis of the ν8 band of deuterated nitric acid (DNO3), J. Mol. Spectrosc., 1991, 149, 2, 425, https://doi.org/10.1016/0022-2852(91)90297-N . [all data]

van der Veken, Pieters, et al., 1982
van der Veken, B.J.; Pieters, G.H.; Herman, M.A.; Durig, J.R., Internal rotation in nitric acid, J. Mol. Struct., 1982, 80, 467, https://doi.org/10.1016/0022-2860(82)87274-8 . [all data]

Tan, Looi, et al., 1991, 2
Tan, T.L.; Looi, E.C.; Lua, K.T.; Maki, A.G.; Johns, J.W.C.; Noel, M., Infrared spectrum of the ν9 and 2ν9-ν9 bands of deuterated nitric acid (DNO3), J. Mol. Spectrosc., 1991, 150, 2, 486, https://doi.org/10.1016/0022-2852(91)90243-4 . [all data]