NaCD3

Vibrational and/or electronic energy levels

Data compiled by: Marilyn E. Jacox

State:   X

Vib.
sym.
 No.   Approximate
 type of mode
 cm-1   Med.   Method   References

a1 1 CD3 s-stretch 2019 m N2 IR Burczyk and Downs, 1990
2 CD3 s-deform. 836 m N2 IR Burczyk and Downs, 1990
3 CNa stretch 278 m N2 IR Burczyk and Downs, 1990
e 4 CD3 a-stretch 2123 m N2 IR Burczyk and Downs, 1990
5 CD3 a-deform. 972 w N2 IR Burczyk and Downs, 1990
6 DCNa bend 285 s N2 IR Burczyk and Downs, 1990

References

Burczyk and Downs, 1990
Burczyk, K.; Downs, A.J., J. Chem. Soc., 1990, Dalton Trans. 2351. [all data]