DNi2OD

Vibrational and/or electronic energy levels

Data compiled by: Marilyn E. Jacox

State:   X

Vib.
sym.
 No.   Approximate
 type of mode
 cm-1   Med.   Method   References

OD stretch 2717.5 Ar IR Park, Hauge, et al., 1988
NiDNi stretch 868.5 Ar IR Park, Hauge, et al., 1988
830.9 Ar IR Park, Hauge, et al., 1988

References

Park, Hauge, et al., 1988
Park, M.; Hauge, R.H.; Margrave, J.L., High Temp. Sci., 1988, 25, 1. [all data]