D3SbO

Vibrational and/or electronic energy levels

Data compiled by: Marilyn E. Jacox

State:   X

Vib.
sym.
 No.   Approximate
 type of mode
 cm-1   Med.   Method   References

a1 2 Sb=O stretch 824.6 Ar IR Andrews, Moores, et al., 1989
3 SbD3 deform. 568 Ar IR Andrews, Moores, et al., 1989
e 4 SbD3 stretch 1413 Ar IR Andrews, Moores, et al., 1989
6 DSbO a-deform. 402.0 Ar IR Andrews, Moores, et al., 1989

References

Andrews, Moores, et al., 1989
Andrews, L.; Moores, B.W.; Fonda, K.K., Matrix infrared spectra of reaction and photolysis products of stibine and ozone, Inorg. Chem., 1989, 28, 2, 290, https://doi.org/10.1021/ic00301a028 . [all data]