DNiND2

Vibrational and/or electronic energy levels

Data compiled by: Marilyn E. Jacox

State:   X

Vib.
sym.
 No.   Approximate
 type of mode
 cm-1   Med.   Method   References

ND2 stretch 2522.9 Ar IR Ball, Hauge, et al., 1988
NiD stretch 1431.3 Ar IR Ball, Hauge, et al., 1988
ND2 scissors 1177.1 Ar IR Ball, Hauge, et al., 1988
NiN stretch 653.6 Ar IR Ball, Hauge, et al., 1988

References

Ball, Hauge, et al., 1988
Ball, D.W.; Hauge, R.H.; Margrave, J.H., High Temp. Sci., 1988, 25, 95. [all data]