D2CCl-Br

Vibrational and/or electronic energy levels

Data compiled by: Marilyn E. Jacox

State:   X

Vib.
sym.
 No.   Approximate
 type of mode
 cm-1   Med.   Method   References

CD2 stretch 2232.3 w m Ar IR Maier, Reisenauer, et al., 1990
CD2 scissors 1069.6 s Ar IR Maier, Reisenauer, et al., 1990
CCl stretch 868.8 m Ar IR Maier, Reisenauer, et al., 1990
CD2 wag 573.3 vs Ar IR Maier, Reisenauer, et al., 1990

References

Maier, Reisenauer, et al., 1990
Maier, G.; Reisenauer, H.P.; Hu, J.; Schaad, L.J.; Hess, B.A., Jr., Photochemical isomerization of dihalomethanes in argon matrixes, J. Am. Chem. Soc., 1990, 112, 13, 5117, https://doi.org/10.1021/ja00169a020 . [all data]