DMnOMnD

Vibrational and/or electronic energy levels

Data compiled by: Marilyn E. Jacox

State:   X

Vib.
sym.
 No.   Approximate
 type of mode
 cm-1   Med.   Method   References

MnD stretch 1175.3 Ar IR Kauffman, Hauge, et al., 1985
Zhou, Zhang, et al., 2001
MnOMn stretch 870.3 Ar IR Kauffman, Hauge, et al., 1985
Zhou, Zhang, et al., 2001

References

Kauffman, Hauge, et al., 1985
Kauffman, J.W.; Hauge, R.H.; Margrave, J.L., Studies of reactions of atomic and diatomic chromium, manganese, iron, cobalt, nickel, copper, and zinc with molecular water at 15 K, J. Phys. Chem., 1985, 89, 16, 3541, https://doi.org/10.1021/j100262a023 . [all data]

Zhou, Zhang, et al., 2001
Zhou, M.; Zhang, L.; Shao, L.; Wang, W.; Fan, K.; Qin, Q., Reactions of Mn with H, J. Phys. Chem. A, 2001, 105, 24, 5801, https://doi.org/10.1021/jp0043118 . [all data]