DCaOCaD

Vibrational and/or electronic energy levels

Data compiled by: Marilyn E. Jacox

State:   X

Vib.
sym.
 No.   Approximate
 type of mode
 cm-1   Med.   Method   References

CaD stretch 851.6 Ar IR Kauffman, Hauge, et al., 1984
CaO stretch 715.0 Ar IR Kauffman, Hauge, et al., 1984

References

Kauffman, Hauge, et al., 1984
Kauffman, J.W.; Hauge, R.H.; Margrave, J.L., High Temp. Sci., 1984, 18, 97. [all data]