DMg2OD

Vibrational and/or electronic energy levels

Data compiled by: Marilyn E. Jacox

State:   X

Vib.
sym.
 No.   Approximate
 type of mode
 cm-1   Med.   Method   References

MgD stretch 1109.6 Ar IR Kauffman, Hauge, et al., 1984
MgO stretch 704.4 Ar IR Kauffman, Hauge, et al., 1984
MgOD bend 569 Ar IR Kauffman, Hauge, et al., 1984
MgMg stretch 536.6 Ar IR Kauffman, Hauge, et al., 1984

References

Kauffman, Hauge, et al., 1984
Kauffman, J.W.; Hauge, R.H.; Margrave, J.L., High Temp. Sci., 1984, 18, 97. [all data]