CD2FCl+

Vibrational and/or electronic energy levels

Data compiled by: Marilyn E. Jacox

State:   X

Vib.
sym.
 No.   Approximate
 type of mode
 cm-1   Med.   Method   References

CD2 stretch 2162 m T Ar IR Prochaska and Andrews, 1980
CCl stretch 843 vs Ar IR Prochaska and Andrews, 1980

References

Prochaska and Andrews, 1980
Prochaska, F.T.; Andrews, L., Infrared and visible absorption spectra and photochemistry of the Ch2FX+, CHFX+, F--H•••(CHX)-, and X--H•••(CHF)- molecular ions in solid argon, J. Chem. Phys., 1980, 73, 6, 2651, https://doi.org/10.1063/1.440478 . [all data]