cyc-C3D2

Vibrational and/or electronic energy levels

Data compiled by: Marilyn E. Jacox

State:   X

Vib.
sym.
 No.   Approximate
 type of mode
 cm-1   Med.   Method   References

a1 3 1261.8 Ar IR Huang and Graham, 1990

References

Huang and Graham, 1990
Huang, J.W.; Graham, W.R.M., Fourier transform infrared study of tricarbon hydride radicals trapped in Ar at 10 K, J. Chem. Phys., 1990, 93, 3, 1583, https://doi.org/10.1063/1.459137 . [all data]