C2D3

Vibrational and/or electronic energy levels

Data compiled by: Marilyn E. Jacox

State:   X

Vib.
sym.
 No.   Approximate
 type of mode
 cm-1   Med.   Method   References

a' 1 CD stretch 2348.0 Ne IR Wu, Lin, et al., 2008
2 CD2 a-stretch 2192.5 Ne IR Wu, Lin, et al., 2008
3 CD2 s-stretch 2124.1 Ne IR Wu, Lin, et al., 2008
5 1002.1 Ne IR Wu, Lin, et al., 2008
Jacox and Thompson, 2011
5 996.5 Kr IR Tanskanen, Khrichtchev, et al., 2005
5 993.8 Xe IR Tanskanen, Khrichtchev, et al., 2005
a 8 Mixed OPLA 705.2 Ne IR Wu, Lin, et al., 2008
Wu, Chen, et al., 2009
Jacox and Thompson, 2011
8 Mixed OPLA 704 Ar IR Shepherd, Doyle, et al., 1988
8 Mixed OPLA 701.7 Kr IR Tanskanen, Khrichtchev, et al., 2005
8 Mixed OPLA 698.9 Xe IR Tanskanen, Khrichtchev, et al., 2005
9 654.5 Ne IR Wu, Lin, et al., 2008
9 612.2 Ne IR Jacox and Thompson, 2011

References

Wu, Lin, et al., 2008
Wu, Y.-J.; Lin, M.-Y.; Cheng, B.-M.; Chen, H.-F.; Lee, Y.-P., Infrared absorption spectra of vinyl radicals isolated in solid Ne, J. Chem. Phys., 2008, 128, 20, 204509, https://doi.org/10.1063/1.2929826 . [all data]

Jacox and Thompson, 2011
Jacox, M.E.; Thompson, W.E., The infrared spectra of C2H4+ and C2H3 trapped in solid neon, J. Chem. Phys., 2011, 134, 6, 064321, https://doi.org/10.1063/1.3555626 . [all data]

Tanskanen, Khrichtchev, et al., 2005
Tanskanen, H.; Khrichtchev, L.; Rasanen, M.; Feldman, V.I.; Sukhov, F.F.; Orlov, A.Yu.; Tyurin, D.A., Infrared absorption and electron paramagnetic resonance studies of vinyl radical in noble-gas matrices, J. Chem. Phys., 2005, 123, 6, 064318, https://doi.org/10.1063/1.2000907 . [all data]

Wu, Chen, et al., 2009
Wu, Y.-J.; Chen, H.-F.; Camacho, C.; Sitek, H.A.; Hsu, S.-C.; Lin, M.-Y.; Chou, S.-L.; Ogilvie, J.F.; Cheng, B.-M., FORMATION AND IDENTIFICATION OF INTERSTELLAR MOLECULE LINEAR C, Astrophys. J., 2009, 701, 1, 8, https://doi.org/10.1088/0004-637X/701/1/8 . [all data]

Shepherd, Doyle, et al., 1988
Shepherd, R.A.; Doyle, T.J.; Graham, W.R.M., A Fourier transform infrared study of the D and 13C substituted C2H3 vinyl radical in solid argon, J. Chem. Phys., 1988, 89, 5, 2738, https://doi.org/10.1063/1.455025 . [all data]