DCu(D2)

Vibrational and/or electronic energy levels

Data compiled by: Marilyn E. Jacox

State:   X

Vib.
sym.
 No.   Approximate
 type of mode
 cm-1   Med.   Method   References

DD stretch 2582.0 w D2 IR Wang, Andrews, et al., 2003
CuD stretch 1344.9 Ne IR Andrews and Wang, 2003
Wang, Andrews, et al., 2003
CuD stretch 1343.2 Ar IR Andrews and Wang, 2003
Wang, Andrews, et al., 2003
CuD stretch 1341.6 D2 IR Andrews and Wang, 2003
Wang, Andrews, et al., 2003

References

Wang, Andrews, et al., 2003
Wang, X.; Andrews, L.; Manceron, L.; Marsden, C., Infrared Spectra and DFT Calculations for the Coinage Metal Hydrides MH, (H, J. Phys. Chem. A, 2003, 107, 41, 8492, https://doi.org/10.1021/jp0354346 . [all data]

Andrews and Wang, 2003
Andrews, L.; Wang, X., Infrared Spectra and Structures of the Stable CuH, J. Am. Chem. Soc., 2003, 125, 38, 11751, https://doi.org/10.1021/ja036307q . [all data]