BiD3

Vibrational and/or electronic energy levels

Data compiled by: Marilyn E. Jacox

State:   X

Vib.
sym.
 No.   Approximate
 type of mode
 cm-1   Med.   Method   References

e 3 Asym. stretch 1243.4 Ne IR Wang, Souter, et al., 2003
3 Asym. stretch 1239.0 D2 IR Wang, Souter, et al., 2003

References

Wang, Souter, et al., 2003
Wang, X.; Souter, P.F.; Andrews, L., Infrared Spectra of Antimony and Bismuth Hydrides in Solid Matrixes, J. Phys. Chem. A, 2003, 107, 21, 4244, https://doi.org/10.1021/jp034379y . [all data]