cis-DOSO

Vibrational and/or electronic energy levels

Data compiled by: Marilyn E. Jacox

State:   X

Vib.
sym.
 No.   Approximate
 type of mode
 cm-1   Med.   Method   References

a' 1 OD stretch 2602 Kr IR Isoniemi, Khriachtchev, et al., 2002
2 SO stretch 1160 Kr IR Isoniemi, Khriachtchev, et al., 2002
4 SO stretch 763 Kr IR Isoniemi, Khriachtchev, et al., 2002

References

Isoniemi, Khriachtchev, et al., 2002
Isoniemi, E.; Khriachtchev, L.; Lundell, J.; Rasanen, M., HSO2 isomers in rare-gas solids, Phys. Chem. Chem. Phys., 2002, 4, 9, 1549, https://doi.org/10.1039/b110109a . [all data]