InInD2

Vibrational and/or electronic energy levels

Data compiled by: Marilyn E. Jacox

State:   X

Vib.
sym.
 No.   Approximate
 type of mode
 cm-1   Med.   Method   References

a1b2 1,5 InD2 stretch 1104.6 Ne IR Wang and Andrews, 2004
1,5 InD2 stretch 1081 Ar IR Himmel, Manceron, et al., 2002
Himmel, Manceron, et al., 2002, 2
1,5 InD2 stretch 1102.9 D2 IR Wang and Andrews, 2004
1,5 InD2 stretch 1098.8 D2 IR Wang and Andrews, 2004
a1 2 InD2 scissors 456.0 D2 IR Wang and Andrews, 2004

References

Wang and Andrews, 2004
Wang, X.; Andrews, L., Infrared Spectra of Indium Hydrides in Solid Hydrogen and Neon, J. Phys. Chem. A, 2004, 108, 20, 4440, https://doi.org/10.1021/jp037942l . [all data]

Himmel, Manceron, et al., 2002
Himmel, H.-J.; Manceron, L.; Downs, A.J.; Pullumbi, P., Characterization and Photochemistry of the Gallium and Indium Subhydrides Ga2H2 and In2H2 This work was supported by the Deutsche Forschungsgemeinschaft (Habilitation grant to H.-J. H.), the CNRS (L. M.), and the EPSRC (A. J. D.)., Angew. Chem. Int. Ed., 2002, 41, 5, 796, https://doi.org/10.1002/1521-3773(20020301)41:5<796::AID-ANIE796>3.0.CO;2-3 . [all data]

Himmel, Manceron, et al., 2002, 2
Himmel, H.-J.; Manceron, L.; Downs, A.J.; Pullumbi, P., Formation and Characterization of the Gallium and Indium Subhydride Molecules Ga, J. Am. Chem. Soc., 2002, 124, 16, 4448, https://doi.org/10.1021/ja0122795 . [all data]