LuD3

Vibrational and/or electronic energy levels

Data compiled by: Marilyn E. Jacox

State:   X

Vib.
sym.
 No.   Approximate
 type of mode
 cm-1   Med.   Method   References

e 3 LuD3 stretch 993.9 Ar IR Willson and Andrews, 2000

References

Willson and Andrews, 2000
Willson, S.P.; Andrews, L., Characterization of the Reaction Products of Laser-Ablated Lanthanide Metal Atoms with Molecular Hydrogen. Infrared Spectra of LnH, LnH, J. Phys. Chem. A, 2000, 104, 8, 1640, https://doi.org/10.1021/jp993038a . [all data]