D2ONb

Vibrational and/or electronic energy levels

Data compiled by: Marilyn E. Jacox

State:   X

Vib.
sym.
 No.   Approximate
 type of mode
 cm-1   Med.   Method   References

D2O bend 1153.2 Ar IR Zhang, Dong, et al., 2001

References

Zhang, Dong, et al., 2001
Zhang, L.; Dong, J.; Zhou, M., Formation and characterization of the AsCO and AsCO- molecules. A matrix isolation FTIR and theoretical study, Chem. Phys. Lett., 2001, 335, 3-4, 334, https://doi.org/10.1016/S0009-2614(01)00015-X . [all data]