DZrOD

Vibrational and/or electronic energy levels

Data compiled by: Marilyn E. Jacox

State:   X

Vib.
sym.
 No.   Approximate
 type of mode
 cm-1   Med.   Method   References

ZrD stretch 1098.2 Ar IR Zhou, Zhang, et al., 2000

References

Zhou, Zhang, et al., 2000
Zhou, M.; Zhang, L.; Dong, J.; Qin, Q., Reactions of Group IV Metal Atoms with Water Molecules. Matrix Isolation FTIR and Theoretical Studies, J. Am. Chem. Soc., 2000, 122, 43, 10680, https://doi.org/10.1021/ja0020658 . [all data]