DCBeD

Vibrational and/or electronic energy levels

Data compiled by: Marilyn E. Jacox

State:   X

Vib.
sym.
 No.   Approximate
 type of mode
 cm-1   Med.   Method   References

Σ+ 2 BeD stretch 1593.5 Ar IR Greene, Lanzisera, et al., 1998
3 CBe stretch 935.2 Ar IR Greene, Lanzisera, et al., 1998
Π 4 Deformation 430.2 Ar IR Greene, Lanzisera, et al., 1998
4 Deformation 427.8 Ar IR Greene, Lanzisera, et al., 1998

References

Greene, Lanzisera, et al., 1998
Greene, T.M.; Lanzisera, D.V.; Andrews, L.; Downs, A.J., A Matrix-Isolation and Density Functional Theory Study of the Reactions of Laser-Ablated Beryllium, Magnesium, and Calcium Atoms with Methane, J. Am. Chem. Soc., 1998, 120, 24, 6097, https://doi.org/10.1021/ja9804870 . [all data]