AlND2

Vibrational and/or electronic energy levels

Data compiled by: Marilyn E. Jacox

State:   X

Vib.
sym.
 No.   Approximate
 type of mode
 cm-1   Med.   Method   References

a1 2 NH2 scissors 1137.7 Ar IR Lanzisera and Andrews, 1997
Himmel, Downs, et al., 2000
3 AlN stretch 694.8 Ar IR Lanzisera and Andrews, 1997
Himmel, Downs, et al., 2000
b1 4 OPLA 314.6 Ar IR Himmel, Downs, et al., 2000

References

Lanzisera and Andrews, 1997
Lanzisera, D.V.; Andrews, L., Reactions of Laser-Ablated Aluminum Atoms with Ammonia. Infrared Spectra of HAlNH, J. Phys. Chem. A, 1997, 101, 28, 5082, https://doi.org/10.1021/jp970560t . [all data]

Himmel, Downs, et al., 2000
Himmel, H.-J.; Downs, A.J.; Greene, T.M., Thermal and Photochemical Reactions of Aluminum, Gallium, and Indium Atoms (M) in the Presence of Ammonia: Generation and Characterization of the Species M·NH, J. Am. Chem. Soc., 2000, 122, 40, 9793, https://doi.org/10.1021/ja001313x . [all data]