DBNB

Vibrational and/or electronic energy levels

Data compiled by: Marilyn E. Jacox

State:   X

Vib.
sym.
 No.   Approximate
 type of mode
 cm-1   Med.   Method   References

Σ+ 1 BD stretch 2218.7 Ar IR Thompson and Andrews, 1995
Thompson, Andrews, et al., 1995
2 BNB a-stretch 1717.6 Ar IR Thompson and Andrews, 1995
Thompson, Andrews, et al., 1995
3 BNB s-stretch 1062.4 Ar IR Thompson and Andrews, 1995
Thompson, Andrews, et al., 1995
Π 4 DBN deform. 596.4 Ar IR Thompson and Andrews, 1995

References

Thompson and Andrews, 1995
Thompson, C.A.; Andrews, L., Reactions of B Atoms with NH3 to Produce HBNH, BNBH, and B2N, J. Am. Chem. Soc., 1995, 117, 40, 10125, https://doi.org/10.1021/ja00145a029 . [all data]

Thompson, Andrews, et al., 1995
Thompson, C.A.; Andrews, L.; Martin, J.M.L.; El-Yazal, J., Infrared Spectra of Boron-Ammonia Reaction Products in Solid Argon, J. Phys. Chem., 1995, 99, 38, 13839, https://doi.org/10.1021/j100038a015 . [all data]