DPSS

Vibrational and/or electronic energy levels

Data compiled by: Marilyn E. Jacox

State:   X

Vib.
sym.
 No.   Approximate
 type of mode
 cm-1   Med.   Method   References

P=S stretch 690.3 Ar IR Mielke and Andrews, 1993
S=S stretch 682.3 Ar IR Mielke and Andrews, 1993
DPS deform. 588.1 Ar IR Mielke and Andrews, 1993

References

Mielke and Andrews, 1993
Mielke, Z.; Andrews, L., Infrared spectra of phosphorus thiohydrides (HSPH2, HPS2, and HSPS2) in solid argon, J. Phys. Chem., 1993, 97, 17, 4313, https://doi.org/10.1021/j100119a011 . [all data]