DMgMgD

Vibrational and/or electronic energy levels

Data compiled by: Marilyn E. Jacox

State:   X

Vib.
sym.
 No.   Approximate
 type of mode
 cm-1   Med.   Method   References

MgD stretch 1088.9 Ne IR Wang and Andrews, 2004
MgD stretch 1084.3 Ar IR Tague and Andrews, 1994
MgD stretch 1084.7 o-D2 IR Wang and Andrews, 2004
MgD stretch 1083.0 D2 IR Wang and Andrews, 2004

References

Wang and Andrews, 2004
Wang, X.; Andrews, L., Infrared Spectra of Magnesium Hydride Molecules, Complexes, and Solid Magnesium Dihydride, J. Phys. Chem. A, 2004, 108, 52, 11511, https://doi.org/10.1021/jp046410h . [all data]

Tague and Andrews, 1994
Tague, T.J., Jr.; Andrews, L., Pulsed Laser Evaporated Magnesium Atom Reactions with Hydrogen: Infrared Spectra of Five Magnesium Hydride Molecules, J. Phys. Chem., 1994, 98, 35, 8611, https://doi.org/10.1021/j100086a004 . [all data]