DPCO

Vibrational and/or electronic energy levels

Data compiled by: Marilyn E. Jacox

State:   X

Vib.
sym.
 No.   Approximate
 type of mode
 cm-1   Med.   Method   References

2 CO stretch 1998.9 Ar IR Mielke and Andrews, 1991

References

Mielke and Andrews, 1991
Mielke, Z.; Andrews, L., Infrared detection of the PCO radical and HPCO molecule, Chem. Phys. Lett., 1991, 181, 4, 355, https://doi.org/10.1016/0009-2614(91)80084-B . [all data]