DOCO+

Vibrational and/or electronic energy levels

Data compiled by: Marilyn E. Jacox

State:   X

Vib.
sym.
 No.   Approximate
 type of mode
 cm-1   Med.   Method   References

a' 1 OD stretch 2564.7 Ne IR Jacox and Thompson, 2003
2 OCO a-stretch 2374.0 Ne IR Jacox and Thompson, 2003
4 OD deform. 843.0 Ne IR Jacox and Thompson, 2003

References

Jacox and Thompson, 2003
Jacox, M.E.; Thompson, W.E., Infrared spectra of HOCO[sup +] and of the complex of H[sub 2] with CO[sub 2][sup -] trapped in solid neon, J. Chem. Phys., 2003, 119, 20, 10824, https://doi.org/10.1063/1.1621383 . [all data]