DMgOD

Vibrational and/or electronic energy levels

Data compiled by: Marilyn E. Jacox

State:   X

Vib.
sym.
 No.   Approximate
 type of mode
 cm-1   Med.   Method   References

Σ+ 2 MgD stretch 1162.8 Ar IR Kauffman, Hauge, et al., 1984
2 MgO stretch 715.3 Ar IR Kauffman, Hauge, et al., 1984

References

Kauffman, Hauge, et al., 1984
Kauffman, J.W.; Hauge, R.H.; Margrave, J.L., High Temp. Sci., 1984, 18, 97. [all data]