DSOD

Vibrational and/or electronic energy levels

Data compiled by: Marilyn E. Jacox

State:   X

Vib.
sym.
 No.   Approximate
 type of mode
 cm-1   Med.   Method   References

OD stretch 2661 w m Ar IR Smardzewski and Lin, 1977
DOS bend 866 m Ar IR Smardzewski and Lin, 1977
SO stretch 775 m s Ar IR Smardzewski and Lin, 1977
DSO bend 737 w m Ar IR Smardzewski and Lin, 1977
Torsion 332 w m Ar IR Smardzewski and Lin, 1977

References

Smardzewski and Lin, 1977
Smardzewski, R.R.; Lin, M.C., Matrix reactions of oxygen atoms with H2S molecules, J. Chem. Phys., 1977, 66, 7, 3197, https://doi.org/10.1063/1.434294 . [all data]