D2GeBr

Vibrational and/or electronic energy levels

Data compiled by: Marilyn E. Jacox

State:   X

Vib.
sym.
 No.   Approximate
 type of mode
 cm-1   Med.   Method   References

GeD stretch 1352 s Ar IR Isabel and Guillory, 1972
GeD stretch 1339 s Ar IR Isabel and Guillory, 1972
GeD2 wag 498 w Ar IR Isabel and Guillory, 1972
GeD2 twist 472 w m Ar IR Isabel and Guillory, 1972
GeBr stretch 279 m s Ar IR Isabel and Guillory, 1972

References

Isabel and Guillory, 1972
Isabel, R.J.; Guillory, W.A., Ultraviolet Photolysis of GeH3Br; Infrared Spectra of Matrix-Isolated GeH2Br and GeHBr, J. Chem. Phys., 1972, 57, 3, 1116, https://doi.org/10.1063/1.1678367 . [all data]