BiD2

Vibrational and/or electronic energy levels

Data compiled by: Marilyn E. Jacox

State:   X

Vib.
sym.
 No.   Approximate
 type of mode
 cm-1   Med.   Method   References

a1 1 BiH2 s-stretch 1218.5 Ne IR Wang, Souter, et al., 2003
1 BiH2 s-stretch 1209.5 Ar IR Wang, Souter, et al., 2003
1 BiH2 s-stretch 1214.4 D2 IR Wang, Souter, et al., 2003
b2 3 BiH2 a-stretch 1223.0 N3 IR Wang, Souter, et al., 2003
3 BiH2 a-stretch 1214.4 Ar IR Wang, Souter, et al., 2003
3 BiH2 a-stretch 1218.4 D2 IR Wang, Souter, et al., 2003

References

Wang, Souter, et al., 2003
Wang, X.; Souter, P.F.; Andrews, L., Infrared Spectra of Antimony and Bismuth Hydrides in Solid Matrixes, J. Phys. Chem. A, 2003, 107, 21, 4244, https://doi.org/10.1021/jp034379y . [all data]