DXeO

Vibrational and/or electronic energy levels

Data compiled by: Marilyn E. Jacox

State:   X

Vib.
sym.
 No.   Approximate
 type of mode
 cm-1   Med.   Method   References

Σ+ 1 XeD stretch 1070.3 Xe IR Khriachtchev, Pettersson, et al., 2003

References

Khriachtchev, Pettersson, et al., 2003
Khriachtchev, L.; Pettersson, M.; Lundell, J.; Tanskanen, H.; Kiviniemi, T.; Runeberg, N.; Rasanen, M., A Neutral Xenon-Containing Radical, HXeO, J. Am. Chem. Soc., 2003, 125, 6, 1454, https://doi.org/10.1021/ja029024r . [all data]