DThO

Vibrational and/or electronic energy levels

Data compiled by: Marilyn E. Jacox

State:   X

Vib.
sym.
 No.   Approximate
 type of mode
 cm-1   Med.   Method   References

a' 1 ThD stretch 1006.7 Ar IR Liang, Andrews, et al., 2002
3 ThO stretch 840.5 Ar IR Liang, Andrews, et al., 2002

References

Liang, Andrews, et al., 2002
Liang, B.; Andrews, L.; Li, J.; Bursten, B.E., Experimental and Theoretical Studies of the Products of Laser-Ablated Thorium Atom Reactions with H, J. Am. Chem. Soc., 2002, 124, 23, 6723, https://doi.org/10.1021/ja012593z . [all data]