NeDF+

Vibrational and/or electronic energy levels

Data compiled by: Marilyn E. Jacox

State:   X

Vib.
sym.
 No.   Approximate
 type of mode
 cm-1   Med.   Method   References

Σ+ 3 DF stretch 1663.0 Ne IR Lugez, Jacox, et al., 1999

References

Lugez, Jacox, et al., 1999
Lugez, C.L.; Jacox, M.E.; Johnson, R.D., III, Vibrational spectra of molecular ions isolated in solid neon. XV. Infrared spectroscopic evidence for NeHF[sup +] and HFFH[sup +], J. Chem. Phys., 1999, 110, 11, 5037, https://doi.org/10.1063/1.478402 . [all data]