CdD2

Vibrational and/or electronic energy levels

Data compiled by: Marilyn E. Jacox

State:   X

Vib.
sym.
 No.   Approximate
 type of mode
 cm-1   Med.   Method   References

Πu 2 Bend 435.6 Ne IR Wang and Andrews, 2004
2 Bend 434.5 Ne IR Wang and Andrews, 2004
2 Bend 434.2 Ar IR Greene, Brown, et al., 1995
2 Bend 432.5 Ar IR Greene, Brown, et al., 1995
2 Bend 435.4 o-D2 IR Wang and Andrews, 2004
2 Bend 434.3 o-D2 IR Wang and Andrews, 2004
2 Bend 435.6 D2 IR Wang and Andrews, 2004
2 Bend 434.5 D2 IR Wang and Andrews, 2004
Σu+ 3 CdD2 a-stretch 1278.31 gas IR Yu, Shayesteh, et al., 2005
Shayesteh, Yu, et al., 2005
3 CdD2 a-stretch 1271.0 Ne IR Wang and Andrews, 2004
3 CdD2 a-stretch 1264.4 Ar IR Greene, Brown, et al., 1995
Macrae, Greene, et al., 2004
3 CdD2 a-stretch 1270.8 o-D2 IR Wang and Andrews, 2004
3 CdD2 a-stretch 1270.1 D2 IR Wang and Andrews, 2004

References

Wang and Andrews, 2004
Wang, X.; Andrews, L., Infrared Spectra of Zn and Cd Hydride Molecules and Solids, J. Phys. Chem. A, 2004, 108, 50, 11006, https://doi.org/10.1021/jp046414m . [all data]

Greene, Brown, et al., 1995
Greene, T.M.; Brown, W.; Andrews, L.; Downs, A.J.; Chertihin, G.V.; Runeberg, N.; Pyykko, P., Matrix Infrared Spectroscopic and ab Initio Studies of ZnH2, CdH2, and Related Metal Hydride Species, J. Phys. Chem., 1995, 99, 20, 7925, https://doi.org/10.1021/j100020a014 . [all data]

Yu, Shayesteh, et al., 2005
Yu, S.; Shayesteh, A.; Bernath, P.F., The vibration-rotation emission spectra of gaseous CdH[sub 2] and CdD[sub 2], J. Chem. Phys., 2005, 122, 19, 194301, https://doi.org/10.1063/1.1895888 . [all data]

Shayesteh, Yu, et al., 2005
Shayesteh, A.; Yu, S.; Bernath, P.F., Gaseous HgH2, CdH2, and ZnH2, Chem. Eur. J., 2005, 11, 16, 4709, https://doi.org/10.1002/chem.200500332 . [all data]

Macrae, Greene, et al., 2004
Macrae, V.A.; Greene, T.M.; Downs, A.J., Matrix Reactivity of Zn, Cd, or Hg Atoms (M) in the Presence of Silane: Photogeneration and Characterization of the Insertion Product HMSiH, J. Phys. Chem. A, 2004, 108, 8, 1393, https://doi.org/10.1021/jp0309769 . [all data]