DXeBr

Vibrational and/or electronic energy levels

Data compiled by: Marilyn E. Jacox

State:   X

Vib.
sym.
 No.   Approximate
 type of mode
 cm-1   Med.   Method   References

Σ+ 1 DXe stretch 1064.1 Ne IR Lorenz, Rasanen, et al., 2000
1 DXe stretch 1100 s Xe IR Pettersson, Lundell, et al., 1995

References

Lorenz, Rasanen, et al., 2000
Lorenz, M.; Rasanen, M.; Bondybey, V.E., Neutral Xenon Hydrides in Solid Neon and Their Intrinsic Stability, J. Phys. Chem. A, 2000, 104, 16, 3770, https://doi.org/10.1021/jp993891+ . [all data]

Pettersson, Lundell, et al., 1995
Pettersson, M.; Lundell, J.; Rasanen, M., Neutral rare-gas containing charge-transfer molecules in solid matrices. I. HXeCl, HXeBr, HXeI, and HKrCl in Kr and Xe, J. Chem. Phys., 1995, 102, 16, 6423, https://doi.org/10.1063/1.469357 . [all data]