ZnD2

Vibrational and/or electronic energy levels

Data compiled by: Marilyn E. Jacox

State:   X

Vib.
sym.
 No.   Approximate
 type of mode
 cm-1   Med.   Method   References

Πu 2 Bend 456.4 Ne IR Wang and Andrews, 2004
2 Bend 454.4 Ar IR Greene, Brown, et al., 1995
2 Bend 456.1 o-D2 IR Wang and Andrews, 2004
2 Bend 456.0 D2 IR Wang and Andrews, 2004
Σu+ 3 Asym. stretch 1371.63 gas IR Shayesteh, Appadoo, et al., 2004
Shayesteh, Yu, et al., 2005
Shayesteh, Gordon, et al., 2005
3 Asym. stretch 1362.6 Ne IR Wang and Andrews, 2004
3 Asym. stretch 1357.9 Ar IR Xiao, Hauge, et al., 1991
Greene, Brown, et al., 1995
3 Asym. stretch 1350.9 Kr IR Xiao, Hauge, et al., 1991
3 Asym. stretch 1363.0 o-D2 IR Wang and Andrews, 2004
3 Asym. stretch 1361.5 D2 IR Wang and Andrews, 2004

References

Wang and Andrews, 2004
Wang, X.; Andrews, L., Infrared Spectra of Zn and Cd Hydride Molecules and Solids, J. Phys. Chem. A, 2004, 108, 50, 11006, https://doi.org/10.1021/jp046414m . [all data]

Greene, Brown, et al., 1995
Greene, T.M.; Brown, W.; Andrews, L.; Downs, A.J.; Chertihin, G.V.; Runeberg, N.; Pyykko, P., Matrix Infrared Spectroscopic and ab Initio Studies of ZnH2, CdH2, and Related Metal Hydride Species, J. Phys. Chem., 1995, 99, 20, 7925, https://doi.org/10.1021/j100020a014 . [all data]

Shayesteh, Appadoo, et al., 2004
Shayesteh, A.; Appadoo, D.R.T.; Gordon, I.E.; Bernath, P.F., Vibration-Rotation Emission Spectra of Gaseous ZnH, J. Am. Chem. Soc., 2004, 126, 44, 14356, https://doi.org/10.1021/ja046050b . [all data]

Shayesteh, Yu, et al., 2005
Shayesteh, A.; Yu, S.; Bernath, P.F., Gaseous HgH2, CdH2, and ZnH2, Chem. Eur. J., 2005, 11, 16, 4709, https://doi.org/10.1002/chem.200500332 . [all data]

Shayesteh, Gordon, et al., 2005
Shayesteh, A.; Gordon, I.E.; Appadoo, D.R.T.; Bernath, P.F., Infrared emission spectra and equilibrium bond lengths of gaseous ZnH2 and ZnD2, Phys. Chem. Chem. Phys., 2005, 7, 17, 3132, https://doi.org/10.1039/b507539d . [all data]

Xiao, Hauge, et al., 1991
Xiao, Z.L.; Hauge, R.H.; Margrave, J.L., High Temp. Sci., 1991, 31, 59. [all data]